filter: rename VIDEO_FILTER_WRAPPER2 to VIDEO_FILTER_WRAPPER

16 jobs for !30 with pic_chain/6 in 50 minutes and 19 seconds (queued for 4 seconds)
latest detached
Status Job ID Name Coverage
  Build
passed #453258
amd64 docker
android-arm

00:03:57

passed #453259
amd64 docker
android-arm64

00:03:27

passed #453260
amd64 docker
android-x86

00:03:20

passed #453261
amd64 docker
android-x86_64

00:04:13

passed #453250
amd64 docker
debian

00:07:51

passed #453254
macos
ios-arm64

00:16:59

passed #453255
macos
ios-armv7

00:16:58

passed #453256
macos
ios-simulator-x86_64

00:17:14

passed #453253
macos
macos

00:16:25

failed #453252
amd64 docker
raspbian-arm

00:08:15

passed #453251
amd64 docker
snap

00:13:06

failed #453257
macos
tvos-arm64

00:33:17

passed #453249
amd64 docker
uwp64-libvlc-llvm

00:04:01

passed #453246
amd64 docker
win32

00:03:01

passed #453247
amd64 docker
win64

00:04:26

passed #453248
amd64 docker
win64-llvm

00:06:18

 
Name Stage Failure
failed
tvos-arm64 Build
make[3]: *** Waiting for unfinished jobs....
make[2]: *** [all] Error 2
make[1]: *** [all-recursive] Error 1
make: *** [all] Error 2
ERROR: Building VLC failed
Running after script...
$ export VLC_CONTRIB_SHA="$(extras/ci/get-contrib-sha.sh)"
$ mv contrib/vlc-contrib-*.tar.bz2 contrib/vlc-contrib-${TRIPLET}-${VLC_CONTRIB_SHA}.tar.bz2 2>/dev/null || true
ERROR: Job failed: exit status 1
failed
raspbian-arm Build
make[2]: *** [Makefile:13540: all] Error 2
make[2]: Leaving directory '/builds/robUx4/vlc/linuxarm/modules'
make[1]: Leaving directory '/builds/robUx4/vlc/linuxarm'
make[1]: *** [Makefile:1585: all-recursive] Error 1
make: *** [Makefile:1470: all] Error 2
Running after script...
$ export VLC_CONTRIB_SHA="$(extras/ci/get-contrib-sha.sh)"
$ mv contrib/vlc-contrib-*.tar.bz2 contrib/vlc-contrib-${TRIPLET}-${VLC_CONTRIB_SHA}.tar.bz2 2>/dev/null || true
ERROR: Job failed: exit code 1