fixup: temporarily disable dav1d

18 jobs for !19 with vlcjs/incoming.1 in 90 minutes and 16 seconds (queued for 4 seconds)
latest detached
Status Job ID Name Coverage
  Build
failed #496380
amd64 docker
android-arm

00:02:40

failed #496381
amd64 docker
android-arm64

00:03:06

failed #496382
amd64 docker
android-x86

00:02:17

failed #496383
amd64 docker
android-x86_64

00:03:24

failed #496372
amd64 docker
debian

00:14:14

failed #496376
macos
ios-arm64

00:39:37

failed #496377
macos
ios-armv7

00:39:32

failed #496378
macos
ios-simulator-x86_64

00:49:40

failed #496375
macos
macos

00:52:07

failed #496374
amd64 docker
raspbian-arm

00:17:44

failed #496373
amd64 docker
snap

00:13:40

failed #496379
macos
tvos-arm64

00:32:02

failed #496371
amd64 docker
uwp-arm64-libvlc-llvm

00:09:22

failed #496370
amd64 docker
uwp64-libvlc-llvm

00:07:51

failed #496384
wasm32-emscripten-build
wasm32-emscripten-build

00:03:44

failed #496367
amd64 docker
win32

00:02:24

failed #496368
amd64 docker
win64

00:02:26

failed #496369
amd64 docker
win64-llvm

00:14:12

 
Name Stage Failure
failed
ios-simulator-x86_64 Build
checking that generated files are newer than configure... done
configure: creating ./config.status
config.status: creating Makefile
config.status: error: cannot find input file: `doc/Makefile.in'
ERROR: Configuring VLC failed
Running after script...
$ export VLC_CONTRIB_SHA="$(extras/ci/get-contrib-sha.sh)"
$ mv contrib/vlc-contrib-*.tar.bz2 contrib/vlc-contrib-${TRIPLET}-${VLC_CONTRIB_SHA}.tar.bz2 2>/dev/null || true
ERROR: Job failed: exit status 1
failed
tvos-arm64 Build
checking that generated files are newer than configure... done
configure: creating ./config.status
config.status: creating Makefile
config.status: error: cannot find input file: `doc/Makefile.in'
ERROR: Configuring VLC failed
Running after script...
$ export VLC_CONTRIB_SHA="$(extras/ci/get-contrib-sha.sh)"
$ mv contrib/vlc-contrib-*.tar.bz2 contrib/vlc-contrib-${TRIPLET}-${VLC_CONTRIB_SHA}.tar.bz2 2>/dev/null || true
ERROR: Job failed: exit status 1
failed
macos Build
parallel-tests: installing 'autotools/test-driver'
bin/Makefile.am: installing 'autotools/depcomp'
configure.ac:4664: error: required file 'compat/pathconf.c' not found
configure.ac: installing 'autotools/ylwrap'
autoreconf: automake failed with exit status: 1
Running after script...
$ export VLC_CONTRIB_SHA="$(extras/ci/get-contrib-sha.sh)"
$ mv contrib/vlc-contrib-*.tar.bz2 contrib/vlc-contrib-${TRIPLET}-${VLC_CONTRIB_SHA}.tar.bz2 2>/dev/null || true
ERROR: Job failed: exit status 1
failed
ios-arm64 Build
checking that generated files are newer than configure... done
configure: creating ./config.status
config.status: creating Makefile
config.status: error: cannot find input file: `doc/Makefile.in'
ERROR: Configuring VLC failed
Running after script...
$ export VLC_CONTRIB_SHA="$(extras/ci/get-contrib-sha.sh)"
$ mv contrib/vlc-contrib-*.tar.bz2 contrib/vlc-contrib-${TRIPLET}-${VLC_CONTRIB_SHA}.tar.bz2 2>/dev/null || true
ERROR: Job failed: exit status 1
failed
ios-armv7 Build
checking that generated files are newer than configure... done
configure: creating ./config.status
config.status: creating Makefile
config.status: error: cannot find input file: `doc/Makefile.in'
ERROR: Configuring VLC failed
Running after script...
$ export VLC_CONTRIB_SHA="$(extras/ci/get-contrib-sha.sh)"
$ mv contrib/vlc-contrib-*.tar.bz2 contrib/vlc-contrib-${TRIPLET}-${VLC_CONTRIB_SHA}.tar.bz2 2>/dev/null || true
ERROR: Job failed: exit status 1
failed
raspbian-arm Build
parallel-tests: installing 'autotools/test-driver'
bin/Makefile.am: installing 'autotools/depcomp'
configure.ac:4664: error: required file 'compat/pathconf.c' not found
configure.ac: installing 'autotools/ylwrap'
autoreconf: automake failed with exit status: 1
Running after script...
$ export VLC_CONTRIB_SHA="$(extras/ci/get-contrib-sha.sh)"
$ mv contrib/vlc-contrib-*.tar.bz2 contrib/vlc-contrib-${TRIPLET}-${VLC_CONTRIB_SHA}.tar.bz2 2>/dev/null || true
ERROR: Job failed: exit code 1
failed
debian Build
parallel-tests: installing 'autotools/test-driver'
bin/Makefile.am: installing 'autotools/depcomp'
configure.ac:4664: error: required file 'compat/pathconf.c' not found
configure.ac: installing 'autotools/ylwrap'
autoreconf: automake failed with exit status: 1
Running after script...
$ export VLC_CONTRIB_SHA="$(extras/ci/get-contrib-sha.sh)"
$ mv contrib/vlc-contrib-*.tar.bz2 contrib/vlc-contrib-${TRIPLET}-${VLC_CONTRIB_SHA}.tar.bz2 2>/dev/null || true
ERROR: Job failed: exit code 1
failed
snap Build
Failed to run 'override-build': Exit code was 1.
package.mak:2: recipe for target 'snap' failed
make: *** [snap] Error 2
Running after_script
Running after script...
$ export VLC_CONTRIB_SHA="$(extras/ci/get-contrib-sha.sh)"
$ mv extras/package/snap/parts/vlc/build/contrib/vlc-contrib-*.tar.bz2 contrib/vlc-contrib-${TRIPLET}-${VLC_CONTRIB_SHA}.tar.bz2 2>/dev/null || true
Cleaning up file based variables
ERROR: Job failed: exit code 1
failed
win64-llvm Build
configure.ac:4664: error: required file 'compat/pathconf.c' not found
configure.ac: installing 'autotools/ylwrap'
autoreconf: automake failed with exit status: 1
Running after_script
Running after script...
$ export VLC_CONTRIB_SHA="$(extras/ci/get-contrib-sha.sh)"
$ mv contrib/vlc-contrib-*.tar.bz2 contrib/vlc-contrib-${TRIPLET}-${VLC_CONTRIB_SHA}.tar.bz2 2>/dev/null || true
Cleaning up file based variables
ERROR: Job failed: exit code 1
failed
uwp-arm64-libvlc-llvm Build
configure.ac:4664: error: required file 'compat/pathconf.c' not found
configure.ac: installing 'autotools/ylwrap'
autoreconf: automake failed with exit status: 1
Running after_script
Running after script...
$ export VLC_CONTRIB_SHA="$(extras/ci/get-contrib-sha.sh)"
$ mv contrib/vlc-contrib-*.tar.bz2 contrib/vlc-contrib-${TRIPLET}-${VLC_CONTRIB_SHA}.tar.bz2 2>/dev/null || true
Cleaning up file based variables
ERROR: Job failed: exit code 1
failed
android-x86_64 Build
bin/Makefile.am: installing 'autotools/depcomp'
configure.ac:4664: error: required file 'compat/pathconf.c' not found
configure.ac: installing 'autotools/ylwrap'
autoreconf: automake failed with exit status: 1
vlc: bootstrap failed
Running after script...
$ export VLC_CONTRIB_SHA="$(extras/ci/get-contrib-sha.sh)"
$ mv contrib/vlc-contrib-*.tar.bz2 contrib/vlc-contrib-${TRIPLET}-${VLC_CONTRIB_SHA}.tar.bz2 2>/dev/null || true
ERROR: Job failed: exit code 1
failed
uwp64-libvlc-llvm Build
configure.ac:4664: error: required file 'compat/pathconf.c' not found
configure.ac: installing 'autotools/ylwrap'
autoreconf: automake failed with exit status: 1
Running after_script
Running after script...
$ export VLC_CONTRIB_SHA="$(extras/ci/get-contrib-sha.sh)"
$ mv contrib/vlc-contrib-*.tar.bz2 contrib/vlc-contrib-${TRIPLET}-${VLC_CONTRIB_SHA}.tar.bz2 2>/dev/null || true
Cleaning up file based variables
ERROR: Job failed: exit code 1
failed
android-x86 Build
bin/Makefile.am: installing 'autotools/depcomp'
configure.ac:4664: error: required file 'compat/pathconf.c' not found
configure.ac: installing 'autotools/ylwrap'
autoreconf: automake failed with exit status: 1
vlc: bootstrap failed
Running after script...
$ export VLC_CONTRIB_SHA="$(extras/ci/get-contrib-sha.sh)"
$ mv contrib/vlc-contrib-*.tar.bz2 contrib/vlc-contrib-${TRIPLET}-${VLC_CONTRIB_SHA}.tar.bz2 2>/dev/null || true
ERROR: Job failed: exit code 1
failed
wasm32-emscripten-build Build
configure.ac:4664: error: required file 'compat/pathconf.c' not found
configure.ac: installing 'autotools/ylwrap'
autoreconf: automake failed with exit status: 1
vlc build: bootstrap failed
Running after_script
Running after script...
$ export VLC_CONTRIB_SHA="$(extras/ci/get-contrib-sha.sh)"
$ mv contrib/vlc-contrib-*.tar.bz2 contrib/vlc-contrib-${TRIPLET}-${VLC_CONTRIB_SHA}.tar.bz2 2>/dev/null || true
ERROR: Job failed: exit code 1
failed
android-arm64 Build
bin/Makefile.am: installing 'autotools/depcomp'
configure.ac:4664: error: required file 'compat/pathconf.c' not found
configure.ac: installing 'autotools/ylwrap'
autoreconf: automake failed with exit status: 1
vlc: bootstrap failed
Running after script...
$ export VLC_CONTRIB_SHA="$(extras/ci/get-contrib-sha.sh)"
$ mv contrib/vlc-contrib-*.tar.bz2 contrib/vlc-contrib-${TRIPLET}-${VLC_CONTRIB_SHA}.tar.bz2 2>/dev/null || true
ERROR: Job failed: exit code 1
failed
android-arm Build
bin/Makefile.am: installing 'autotools/depcomp'
configure.ac:4664: error: required file 'compat/pathconf.c' not found
configure.ac: installing 'autotools/ylwrap'
autoreconf: automake failed with exit status: 1
vlc: bootstrap failed
Running after script...
$ export VLC_CONTRIB_SHA="$(extras/ci/get-contrib-sha.sh)"
$ mv contrib/vlc-contrib-*.tar.bz2 contrib/vlc-contrib-${TRIPLET}-${VLC_CONTRIB_SHA}.tar.bz2 2>/dev/null || true
ERROR: Job failed: exit code 1
failed
win64 Build
../src/pthreads/rules.mak:23: recipe for target '../tarballs/mingw-w64-a32b622261b490ec4e4f675dfef010d1274c6c4d.tar.xz' failed
From http://git.videolan.org/git/ffmpeg
* branch HEAD -> FETCH_HEAD
Running after_script
Running after script...
$ export VLC_CONTRIB_SHA="$(extras/ci/get-contrib-sha.sh)"
$ mv contrib/vlc-contrib-*.tar.bz2 contrib/vlc-contrib-${TRIPLET}-${VLC_CONTRIB_SHA}.tar.bz2 2>/dev/null || true
Cleaning up file based variables
ERROR: Job failed: exit code 1
failed
win32 Build
make: *** Waiting for unfinished jobs....
From http://git.videolan.org/git/ffmpeg
* branch HEAD -> FETCH_HEAD
Running after_script
Running after script...
$ export VLC_CONTRIB_SHA="$(extras/ci/get-contrib-sha.sh)"
$ mv contrib/vlc-contrib-*.tar.bz2 contrib/vlc-contrib-${TRIPLET}-${VLC_CONTRIB_SHA}.tar.bz2 2>/dev/null || true
Cleaning up file based variables
ERROR: Job failed: exit code 1