wip: remove dav1d because the new version does not compile

issue is with stdatomic.h and thread_dependency
22 jobs for !15 with vlcjs/wip/build.10 in 141 minutes and 25 seconds (queued for 5 seconds)
latest detached
Status Job ID Name Coverage
  Build
failed #495500
amd64 docker
android-arm

00:04:50

failed #495501
amd64 docker
android-arm64

00:05:01

failed #495502
amd64 docker
android-x86

00:06:17

failed #495503
amd64 docker
android-x86_64

00:05:33

failed #495492
amd64 docker
debian

00:06:55

passed #495496
macos
ios-arm64

00:46:00

failed #495497
macos
ios-armv7

00:45:23

passed #495498
macos
ios-simulator-x86_64

00:50:06

failed #495495
macos
macos

00:40:20

failed #495494
amd64 docker
raspbian-arm

00:05:07

failed #495493
amd64 docker
snap

00:10:55

passed #495499
macos
tvos-arm64

00:46:26

passed #495491
amd64 docker
uwp-arm64-libvlc-llvm

00:10:24

passed #495490
amd64 docker
uwp64-libvlc-llvm

00:10:31

passed #495504
wasm32-emscripten-build
wasm32-emscripten-build

00:06:07

canceled #495609
amd64 docker
win32

00:05:59

failed #495488
amd64 docker
win64

00:39:40

failed #495489
amd64 docker
win64-llvm

00:37:03

failed #495537
docker amd64
win32

00:01:18

failed #495534
amd64 docker
win32

00:01:23

failed #495528
docker amd64
win32

00:13:17

failed #495487
amd64 docker
win32

00:38:57

 
Name Stage Failure
failed
ios-armv7 Build
make[3]: *** [all-recursive] Error 1
make[2]: *** [all] Error 2
make[1]: *** [all-recursive] Error 1
make: *** [all] Error 2
ERROR: Building VLC failed
Running after script...
$ export VLC_CONTRIB_SHA="$(extras/ci/get-contrib-sha.sh)"
$ mv contrib/vlc-contrib-*.tar.bz2 contrib/vlc-contrib-${TRIPLET}-${VLC_CONTRIB_SHA}.tar.bz2 2>/dev/null || true
ERROR: Job failed: exit status 1
failed
macos Build
To configure your current shell, run:
source /Users/videolan/builds/F52MDqw7/0/b1ue/vlc/contrib/bin/.cargo/env
. /Users/videolan/builds/F52MDqw7/0/b1ue/vlc/contrib/bin/.cargo/env && RUSTUP_HOME=/Users/videolan/builds/F52MDqw7/0/b1ue/vlc/contrib/bin/.rustup CARGO_HOME=/Users/videolan/builds/F52MDqw7/0/b1ue/vlc/contrib/bin/.cargo rustup default 1.47.0
/bin/sh: /Users/videolan/builds/F52MDqw7/0/b1ue/vlc/contrib/bin/.cargo/env: No such file or directory
make: *** [.cargo] Error 1
Running after script...
$ export VLC_CONTRIB_SHA="$(extras/ci/get-contrib-sha.sh)"
$ mv contrib/vlc-contrib-*.tar.bz2 contrib/vlc-contrib-${TRIPLET}-${VLC_CONTRIB_SHA}.tar.bz2 2>/dev/null || true
ERROR: Job failed: exit status 1
failed
win64 Build
source /builds/b1ue/vlc/contrib/bin/.cargo/env
. /builds/b1ue/vlc/contrib/bin/.cargo/env && RUSTUP_HOME=/builds/b1ue/vlc/contrib/bin/.rustup CARGO_HOME=/builds/b1ue/vlc/contrib/bin/.cargo rustup default 1.47.0
/bin/sh: 1: .: Can't open /builds/b1ue/vlc/contrib/bin/.cargo/env
../src/cargo/rules.mak:33: recipe for target '.cargo' failed
make: *** [.cargo] Error 2
Running after script...
$ export VLC_CONTRIB_SHA="$(extras/ci/get-contrib-sha.sh)"
$ mv contrib/vlc-contrib-*.tar.bz2 contrib/vlc-contrib-${TRIPLET}-${VLC_CONTRIB_SHA}.tar.bz2 2>/dev/null || true
ERROR: Job failed: exit code 1
failed
win64-llvm Build
To configure your current shell, run:
source /builds/b1ue/vlc/contrib/bin/.cargo/env
. /builds/b1ue/vlc/contrib/bin/.cargo/env && RUSTUP_HOME=/builds/b1ue/vlc/contrib/bin/.rustup CARGO_HOME=/builds/b1ue/vlc/contrib/bin/.cargo rustup default 1.47.0
/bin/sh: 1: .: Can't open /builds/b1ue/vlc/contrib/bin/.cargo/env
make: *** [../src/cargo/rules.mak:34: .cargo] Error 127
Running after script...
$ export VLC_CONTRIB_SHA="$(extras/ci/get-contrib-sha.sh)"
$ mv contrib/vlc-contrib-*.tar.bz2 contrib/vlc-contrib-${TRIPLET}-${VLC_CONTRIB_SHA}.tar.bz2 2>/dev/null || true
ERROR: Job failed: exit code 1
failed
android-x86_64 Build
make[1]: Leaving directory '/builds/b1ue/vlc/contrib/contrib-android-x86_64-linux-android/aom/aom_build'
touch .aom
contribs: make failed
Running after_script
Running after script...
$ export VLC_CONTRIB_SHA="$(extras/ci/get-contrib-sha.sh)"
$ mv contrib/vlc-contrib-*.tar.bz2 contrib/vlc-contrib-${TRIPLET}-${VLC_CONTRIB_SHA}.tar.bz2 2>/dev/null || true
Cleaning up file based variables
ERROR: Job failed: exit code 1
failed
android-x86 Build
make[1]: Leaving directory '/builds/b1ue/vlc/contrib/contrib-android-i686-linux-android/aom/aom_build'
touch .aom
contribs: make failed
Running after_script
Running after script...
$ export VLC_CONTRIB_SHA="$(extras/ci/get-contrib-sha.sh)"
$ mv contrib/vlc-contrib-*.tar.bz2 contrib/vlc-contrib-${TRIPLET}-${VLC_CONTRIB_SHA}.tar.bz2 2>/dev/null || true
Cleaning up file based variables
ERROR: Job failed: exit code 1
failed
android-arm64 Build
make[1]: Leaving directory '/builds/b1ue/vlc/contrib/contrib-android-aarch64-linux-android/aom/aom_build'
touch .aom
contribs: make failed
Running after_script
Running after script...
$ export VLC_CONTRIB_SHA="$(extras/ci/get-contrib-sha.sh)"
$ mv contrib/vlc-contrib-*.tar.bz2 contrib/vlc-contrib-${TRIPLET}-${VLC_CONTRIB_SHA}.tar.bz2 2>/dev/null || true
Cleaning up file based variables
ERROR: Job failed: exit code 1
failed
android-arm Build
make[1]: Leaving directory '/builds/b1ue/vlc/contrib/contrib-android-arm-linux-androideabi/aom/aom_build'
touch .aom
contribs: make failed
Running after_script
Running after script...
$ export VLC_CONTRIB_SHA="$(extras/ci/get-contrib-sha.sh)"
$ mv contrib/vlc-contrib-*.tar.bz2 contrib/vlc-contrib-${TRIPLET}-${VLC_CONTRIB_SHA}.tar.bz2 2>/dev/null || true
Cleaning up file based variables
ERROR: Job failed: exit code 1
failed
raspbian-arm Build
. /builds/b1ue/vlc/contrib/bin/.cargo/env && RUSTUP_HOME=/builds/b1ue/vlc/contrib/bin/.rustup CARGO_HOME=/builds/b1ue/vlc/contrib/bin/.cargo rustup default 1.47.0
/bin/sh: 1: .: Can't open /builds/b1ue/vlc/contrib/bin/.cargo/env
make: *** [../src/cargo/rules.mak:34: .cargo] Error 127
Running after_script
Running after script...
$ export VLC_CONTRIB_SHA="$(extras/ci/get-contrib-sha.sh)"
$ mv contrib/vlc-contrib-*.tar.bz2 contrib/vlc-contrib-${TRIPLET}-${VLC_CONTRIB_SHA}.tar.bz2 2>/dev/null || true
Cleaning up file based variables
ERROR: Job failed: exit code 1
failed
snap Build
Failed to run 'override-build': Exit code was 2.
package.mak:2: recipe for target 'snap' failed
make: *** [snap] Error 2
Running after_script
Running after script...
$ export VLC_CONTRIB_SHA="$(extras/ci/get-contrib-sha.sh)"
$ mv extras/package/snap/parts/vlc/build/contrib/vlc-contrib-*.tar.bz2 contrib/vlc-contrib-${TRIPLET}-${VLC_CONTRIB_SHA}.tar.bz2 2>/dev/null || true
Cleaning up file based variables
ERROR: Job failed: exit code 1
failed
debian Build
  115 | class FloatProxy {
| ^~~~~~~~~~
touch .glslang
Running after_script
Running after script...
$ export VLC_CONTRIB_SHA="$(extras/ci/get-contrib-sha.sh)"
$ mv contrib/vlc-contrib-*.tar.bz2 contrib/vlc-contrib-${TRIPLET}-${VLC_CONTRIB_SHA}.tar.bz2 2>/dev/null || true
Cleaning up file based variables
ERROR: Job failed: exit code 1