unittest: Check for expected triggers after each migration

(cherry picked from commit 49941722)
Signed-off-by: Hugo Beauzée-Luyssen <hugo@beauzee.fr>
4 jobs for 0.4.x in 19 minutes and 31 seconds (queued for 10 minutes and 3 seconds)
latest
Status Job ID Name Coverage
  Test
passed #281098
amd64 debian
asan-ubsan

00:11:12

passed #281095
amd64 debian
linux

00:08:18

failed #281096
win32
win32

00:11:37

failed #281097
win64
win64

00:09:39

 
Name Stage Failure
failed
win32 Test
[  FAILED  ] SamplesTests/Tests.Parse/7, where GetParam() = "release_year_same"
[ FAILED ] SamplesTests/RefreshTests.Refresh/16, where GetParam() = "playlist_external_folder"

5 FAILED TESTS
[swscaler @ 6e33cb00] deprecated pixel format used, make sure you did set range correctly
[swscaler @ 6e67a240] deprecated pixel format used, make sure you did set range correctly
[swscaler @ 65864940] deprecated pixel format used, make sure you did set range correctly
[swscaler @ 65872580] deprecated pixel format used, make sure you did set range correctly
ERROR: Job failed: exit code 1
failed
win64 Test
[  FAILED  ] 1 test, listed below:
[ FAILED ] SamplesTests/Tests.Parse/16, where GetParam() = "playlist_external_folder"

1 FAILED TEST
[swscaler @ 000000002ecdb340] deprecated pixel format used, make sure you did set range correctly
[swscaler @ 00000000314d3480] deprecated pixel format used, make sure you did set range correctly
[swscaler @ 00000000314f21c0] deprecated pixel format used, make sure you did set range correctly
[swscaler @ 00000000314f8240] deprecated pixel format used, make sure you did set range correctly
ERROR: Job failed: exit code 1