libvlc: add 2 patches fixing SMBv2 authentication and enabling SMBv3

3 jobs for !68 with 3.0-fix-smbv2-addsmbv3 in 19 minutes and 27 seconds (queued for 1 second)
detached
Status Job ID Name Coverage
  Build
failed #460813
macos
continous-MobileVLCKit

00:18:29

failed #460814
macos
continous-TVVLCKit

00:18:28

failed #460815
macos
continous-VLCKit

00:19:25

 
Name Stage Failure
failed
continous-VLCKit Build
grep -- " libsmb2-master.zip$" "../src/smb2/SHA512SUMS" && (cd ../tarballs && shasum -a 512 --check /dev/stdin) < "../src/smb2/SHA512SUMS"
0a0da0eb32193a1b6df539d7e688292c59e7b98355eb307b56d19f88b2e74c5dbcdc33f0a16929259c0407fcbddaf4cf019e456f6f583b6b2d14f2a61855e21b libsmb2-master.zip
libsmb2-master.zip: FAILED
shasum: WARNING: 1 computed checksum did NOT match
make: *** [.sum-smb2] Error 1
make: *** Waiting for unfinished jobs....
From http://git.videolan.org/git/ffmpeg
* branch HEAD -> FETCH_HEAD
ERROR: Job failed: exit status 1
failed
continous-MobileVLCKit Build
grep -- " libsmb2-master.zip$" "../src/smb2/SHA512SUMS" && (cd ../tarballs && shasum -a 512 --check /dev/stdin) < "../src/smb2/SHA512SUMS"
0a0da0eb32193a1b6df539d7e688292c59e7b98355eb307b56d19f88b2e74c5dbcdc33f0a16929259c0407fcbddaf4cf019e456f6f583b6b2d14f2a61855e21b libsmb2-master.zip
libsmb2-master.zip: FAILED
shasum: WARNING: 1 computed checksum did NOT match
make: *** [.sum-smb2] Error 1
make: *** Waiting for unfinished jobs....
From http://git.videolan.org/git/ffmpeg
* branch HEAD -> FETCH_HEAD
ERROR: Job failed: exit status 1
failed
continous-TVVLCKit Build
grep -- " libsmb2-master.zip$" "../src/smb2/SHA512SUMS" && (cd ../tarballs && shasum -a 512 --check /dev/stdin) < "../src/smb2/SHA512SUMS"
0a0da0eb32193a1b6df539d7e688292c59e7b98355eb307b56d19f88b2e74c5dbcdc33f0a16929259c0407fcbddaf4cf019e456f6f583b6b2d14f2a61855e21b libsmb2-master.zip
libsmb2-master.zip: FAILED
shasum: WARNING: 1 computed checksum did NOT match
make: *** [.sum-smb2] Error 1
make: *** Waiting for unfinished jobs....
From http://git.videolan.org/git/ffmpeg
* branch HEAD -> FETCH_HEAD
ERROR: Job failed: exit status 1