Fix

Status Job ID Name Coverage
  Test
failed #14
build

00:00:07

failed #13
build

00:00:06

failed #12
build

00:00:02

 
Name Stage Failure
failed
build Test There is an unknown failure, please try again
/home/gitlab-runner/builds/8739637e/0/thresh/npapi-vlc/libvlcpp/vlcpp/Media.hpp:39:7: note:   candidate expects 1 argument, 5 provided
examples/imem/CMakeFiles/imem.dir/build.make:54: recipe for target 'examples/imem/CMakeFiles/imem.dir/imem.cpp.o' failed
make[2]: *** [examples/imem/CMakeFiles/imem.dir/imem.cpp.o] Error 1
CMakeFiles/Makefile2:193: recipe for target 'examples/imem/CMakeFiles/imem.dir/all' failed
make[1]: *** [examples/imem/CMakeFiles/imem.dir/all] Error 2
Makefile:76: recipe for target 'all' failed
make: *** [all] Error 2

ERROR: Build failed with: exit status 1