Added a configure switch to enable/disable examples build

4 jobs for noexamples in 1 minute and 54 seconds
Status Job ID Name Coverage
  Build
passed #239481
amd64 debian
build-debian

00:00:43

passed #239482
macos
build-macos

00:00:28

failed #239484
win32 amd64 debian
build-win32

00:00:35

failed #239483
win64 amd64 debian
build-win64

00:00:34

 
Name Stage Failure
failed
build-win32 Build
make[2]: *** [all-recursive] Error 1
Makefile:627: recipe for target 'all-recursive' failed
make[2]: Leaving directory '/builds/thresh/libdvbpsi/build/examples'
make[1]: *** [all-recursive] Error 1
Makefile:464: recipe for target 'all-recursive' failed
make[1]: Leaving directory '/builds/thresh/libdvbpsi/build'
Makefile:371: recipe for target 'all' failed
make: *** [all] Error 2
ERROR: Job failed: exit code 1
failed
build-win64 Build
Makefile:627: recipe for target 'all-recursive' failed
make[2]: Leaving directory '/builds/thresh/libdvbpsi/build/examples'
make[2]: *** [all-recursive] Error 1
make[1]: *** [all-recursive] Error 1
Makefile:464: recipe for target 'all-recursive' failed
make[1]: Leaving directory '/builds/thresh/libdvbpsi/build'
Makefile:371: recipe for target 'all' failed
make: *** [all] Error 2
ERROR: Job failed: exit code 1