CI: added debian, macos, win32 and win64 build jobs.

4 jobs for ci in 2 minutes and 26 seconds (queued for 2 seconds)
Status Job ID Name Coverage
  Build
passed #239465
amd64 debian
build-debian

00:00:47

passed #239466
macos
build-macos

00:00:28

failed #239468
win32 amd64 debian
build-win32

00:00:35

failed #239467
win64 amd64 debian
build-win64

00:00:35

 
Name Stage Failure
failed
build-win32 Build
make[2]: *** [all-recursive] Error 1
Makefile:627: recipe for target 'all-recursive' failed
make[2]: Leaving directory '/builds/thresh/libdvbpsi/build/examples'
make[1]: *** [all-recursive] Error 1
Makefile:463: recipe for target 'all-recursive' failed
make[1]: Leaving directory '/builds/thresh/libdvbpsi/build'
Makefile:370: recipe for target 'all' failed
make: *** [all] Error 2
ERROR: Job failed: exit code 1
failed
build-win64 Build
make[2]: *** [all-recursive] Error 1
Makefile:627: recipe for target 'all-recursive' failed
make[2]: Leaving directory '/builds/thresh/libdvbpsi/build/examples'
make[1]: *** [all-recursive] Error 1
Makefile:463: recipe for target 'all-recursive' failed
make[1]: Leaving directory '/builds/thresh/libdvbpsi/build'
make: *** [all] Error 2
Makefile:370: recipe for target 'all' failed
ERROR: Job failed: exit code 1